{"text_format":"1","workbook":"xlsx","n_sheets":9,"sheets":["coeff","h2h","line","multiple Lines","totals","futures","Sheet1","Sheet4","Sheet3"],"not_rendered":{"charts":0,"images":0,"macros":1,"external_links":0,"defined_names":72,"comments":0,"pivot_tables":0},"unopened":[],"bounds":{"document_bytes":16777216,"sheet_cells":100000,"rows_first":2000,"rows_last":500,"rows_between":2000,"halvings":0,"cell_chars":16384,"cell_head_chars":4096},"cells_cut":0,"cells_raw":0,"read":"whole","date_system":"1900"}

{"sheet":"coeff","index":0,"n_rows":74,"n_cols":8,"rows_kept":74,"cut":false,"hidden":false,"merged":[]}
["Verson 2018.1"]
[null,null,null,null,null,"LineCoeff"]
[null,"Kelly","Bank",null,null,-35.5,-3.7962769781706847,0.12113639625034371]
["h2h",10,10000,null,null,-34.5,-3.7241716989922953,0.11454654809718384]
["line",10,10000,null,null,-33.5,-3.556536628534277,0.12113125246214561]
["futures",25,10000,null,null,-32.5,-3.5503096194370567,0.12111879837671764]
["totals",10,10000,null,null,-31.5,-3.2686880953212731,0.11437369202153286]
[null,null,null,null,null,-30.5,-3.2558039073775817,0.11374583120122937]
[null,null,null,null,null,-29.5,-3.0286186871482714,0.11198968400773601]
[null,null,null,null,null,-28.5,-2.9981131931794418,0.11061597752237738]
{"$rows_left_out":65}
{"sheet":"h2h","index":1,"n_rows":14,"n_cols":8,"rows_kept":14,"cut":false,"hidden":false,"merged":[]}
[]
[]
["Team1","Team2","PlayerProb","Odds1","Odds2","$Bet1","$Bet2","Overlay"]
["Penrith","Canterbury",0.50600000000000001,2.25,1.72,{"$f":"IF(D4=\"\",\"\",IF((C4*D4-1)>=0.05,coeff!$C$4/coeff!$B$4*(C4*D4-1)/(D4-1),0))","v":110.80000000000004},{"$f":"IF(E4=\"\",\"\",IF((E4*(1-C4)-1)>=0.05,coeff!$C$4/coeff!$B$4*(E4*(1-C4)-1)/(E4-1),0))","v":0},{"$f":"IF(C4=\"\",\"\",IF(F4>0,C4*D4-1,IF(G4>0,E4*(1-C4)-1,\"\")))","v":0.13850000000000007}]
["Brisbane","New Zealand",0.71299999999999997,1.33,3.52,{"$f":"IF(D5=\"\",\"\",IF((C5*D5-1)>=0.05,coeff!$C$4/coeff!$B$4*(C5*D5-1)/(D5-1),0))","v":0},{"$f":"IF(E5=\"\",\"\",IF((E5*(1-C5)-1)>=0.05,coeff!$C$4/coeff!$B$4*(E5*(1-C5)-1)/(E5-1),0))","v":0},{"$f":"IF(C5=\"\",\"\",IF(F5>0,C5*D5-1,IF(G5>0,E5*(1-C5)-1,\"\")))","v":""}]
[null,null,null,null,null,{"$f":"IF(D6=\"\",\"\",IF((C6*D6-1)>=0.05,coeff!$C$4/coeff!$B$4*(C6*D6-1)/(D6-1),0))","v":""},{"$f":"IF(E6=\"\",\"\",IF((E6*(1-C6)-1)>=0.05,coeff!$C$4/coeff!$B$4*(E6*(1-C6)-1)/(E6-1),0))","v":""},""]
[null,null,null,null,null,{"$f":"IF(D7=\"\",\"\",IF((C7*D7-1)>=0.05,coeff!$C$4/coeff!$B$4*(C7*D7-1)/(D7-1),0))","v":""},{"$f":"IF(E7=\"\",\"\",IF((E7*(1-C7)-1)>=0.05,coeff!$C$4/coeff!$B$4*(E7*(1-C7)-1)/(E7-1),0))","v":""},""]
[null,null,null,null,null,{"$f":"IF(D8=\"\",\"\",IF((C8*D8-1)>=0.05,coeff!$C$4/coeff!$B$4*(C8*D8-1)/(D8-1),0))","v":""},{"$f":"IF(E8=\"\",\"\",IF((E8*(1-C8)-1)>=0.05,coeff!$C$4/coeff!$B$4*(E8*(1-C8)-1)/(E8-1),0))","v":""},""]
[null,null,null,null,null,{"$f":"IF(D9=\"\",\"\",IF((C9*D9-1)>=0.05,coeff!$C$4/coeff!$B$4*(C9*D9-1)/(D9-1),0))","v":""},{"$f":"IF(E9=\"\",\"\",IF((E9*(1-C9)-1)>=0.05,coeff!$C$4/coeff!$B$4*(E9*(1-C9)-1)/(E9-1),0))","v":""},""]
[null,null,null,null,null,{"$f":"IF(D10=\"\",\"\",IF((C10*D10-1)>=0.05,coeff!$C$4/coeff!$B$4*(C10*D10-1)/(D10-1),0))","v":""},{"$f":"IF(E10=\"\",\"\",IF((E10*(1-C10)-1)>=0.05,coeff!$C$4/coeff!$B$4*(E10*(1-C10)-1)/(E10-1),0))","v":""},""]
{"$rows_left_out":5}
{"sheet":"line","index":2,"n_rows":17,"n_cols":10,"rows_kept":17,"cut":false,"hidden":false,"merged":[]}
[]
[]
["Team1","Team2","PlayerProb","Line","Odds1","Odds2","LineProb","$Bet1","$Bet2","Overlay"]
["Penrith","Canterbury",{"$f":"IF(h2h!C4=\"\",\"\",h2h!C4)","v":0.50600000000000001},4.5,1.77,2.11,{"$f":"IF(D4=\"\",\"\",IF(ISERROR(VLOOKUP(D4,coeff!$F$3:$H$74,2,FALSE))=FALSE,EXP(VLOOKUP(D4,coeff!$F$3:$H$74,2,FALSE)+VLOOKUP(D4,coeff!$F$3:$H$74,3,FALSE)*(LN(1/(1-C4)-1)/0.089))/(1+EXP(VLOOKUP(D4,coeff!$F$3:$H$74,2,FALSE)+VLOOKUP(D4,coeff!$F$3:$H$74,3,FALSE)*(LN(1/(1-C4)-1)/0.089))),(EXP(VLOOKUP(D4+0.5,coeff!$F$3:$H$74,2,FALSE)+VLOOKUP(D4+0.5,coeff!$F$3:$H$74,3,FALSE)*(LN(1/(1-C4)-1)/0.089))/(1+EXP(VLOOKUP(D4+0.5,coeff!$F$3:$H$74,2,FALSE)+VLOOKUP(D4+0.5,coeff!$F$3:$H$74,3,FALSE)*(LN(1/(1-C4)-1)/0.089)))+EXP(VLOOKUP(D4-0.5,coeff!$F$3:$H$74,2,FALSE)+VLOOKUP(D4-0.5,coeff!$F$3:$H$74,3,FALSE)*(LN(1/(1-C4)-1)/0.089))/(1+EXP(VLOOKUP(D4-0.5,coeff!$F$3:$H$74,2,FALSE)+VLOOKUP(D4-0.5,coeff!$F$3:$H$74,3,FALSE)*(LN(1/(1-C4)-1)/0.089))))/2))","v":0.62888617196959873},{"$f":"IF(D4=\"\",\"\",IF((G4*E4-1)>=0.05,coeff!$C$5/coeff!$B$5*(G4*E4-1)/(E4-1),0))","v":146.92016154050609},{"$f":"IF(D4=\"\",\"\",IF((F4*(1-G4)-1)>=0.05,coeff!$C$5/coeff!$B$5*(F4*(1-G4)-1)/(F4-1),0))","v":0},{"$f":"IF(C4=\"\",\"\",IF(H4>0,E4*G4-1,IF(I4>0,F4*(1-G4)-1,\"\")))","v":0.1131285243861897}]
["Brisbane","New Zealand",{"$f":"IF(h2h!C5=\"\",\"\",h2h!C5)","v":0.71299999999999997},-9.5,1.93,1.93,{"$f":"IF(D5=\"\",\"\",IF(ISERROR(VLOOKUP(D5,coeff!$F$3:$H$74,2,FALSE))=FALSE,EXP(VLOOKUP(D5,coeff!$F$3:$H$74,2,FALSE)+VLOOKUP(D5,coeff!$F$3:$H$74,3,FALSE)*(LN(1/(1-C5)-1)/0.089))/(1+EXP(VLOOKUP(D5,coeff!$F$3:$H$74,2,FALSE)+VLOOKUP(D5,coeff!$F$3:$H$74,3,FALSE)*(LN(1/(1-C5)-1)/0.089))),(EXP(VLOOKUP(D5+0.5,coeff!$F$3:$H$74,2,FALSE)+VLOOKUP(D5+0.5,coeff!$F$3:$H$74,3,FALSE)*(LN(1/(1-C5)-1)/0.089))/(1+EXP(VLOOKUP(D5+0.5,coeff!$F$3:$H$74,2,FALSE)+VLOOKUP(D5+0.5,coeff!$F$3:$H$74,3,FALSE)*(LN(1/(1-C5)-1)/0.089)))+EXP(VLOOKUP(D5-0.5,coeff!$F$3:$H$74,2,FALSE)+VLOOKUP(D5-0.5,coeff!$F$3:$H$74,3,FALSE)*(LN(1/(1-C5)-1)/0.089))/(1+EXP(VLOOKUP(D5-0.5,coeff!$F$3:$H$74,2,FALSE)+VLOOKUP(D5-0.5,coeff!$F$3:$H$74,3,FALSE)*(LN(1/(1-C5)-1)/0.089))))/2))","v":0.47828081713072385},{"$f":"IF(D5=\"\",\"\",IF((G5*E5-1)>=0.05,coeff!$C$5/coeff!$B$5*(G5*E5-1)/(E5-1),0))","v":0},{"$f":"IF(D5=\"\",\"\",IF((F5*(1-G5)-1)>=0.05,coeff!$C$5/coeff!$B$5*(F5*(1-G5)-1)/(F5-1),0))","v":0},{"$f":"IF(C5=\"\",\"\",IF(H5>0,E5*G5-1,IF(I5>0,F5*(1-G5)-1,\"\")))","v":""}]
[null,null,{"$f":"IF(h2h!C6=\"\",\"\",h2h!C6)","v":""},null,null,null,{"$f":"IF(D6=\"\",\"\",IF(ISERROR(VLOOKUP(D6,coeff!$F$3:$H$74,2,FALSE))=FALSE,EXP(VLOOKUP(D6,coeff!$F$3:$H$74,2,FALSE)+VLOOKUP(D6,coeff!$F$3:$H$74,3,FALSE)*(LN(1/(1-C6)-1)/0.089))/(1+EXP(VLOOKUP(D6,coeff!$F$3:$H$74,2,FALSE)+VLOOKUP(D6,coeff!$F$3:$H$74,3,FALSE)*(LN(1/(1-C6)-1)/0.089))),(EXP(VLOOKUP(D6+0.5,coeff!$F$3:$H$74,2,FALSE)+VLOOKUP(D6+0.5,coeff!$F$3:$H$74,3,FALSE)*(LN(1/(1-C6)-1)/0.089))/(1+EXP(VLOOKUP(D6+0.5,coeff!$F$3:$H$74,2,FALSE)+VLOOKUP(D6+0.5,coeff!$F$3:$H$74,3,FALSE)*(LN(1/(1-C6)-1)/0.089)))+EXP(VLOOKUP(D6-0.5,coeff!$F$3:$H$74,2,FALSE)+VLOOKUP(D6-0.5,coeff!$F$3:$H$74,3,FALSE)*(LN(1/(1-C6)-1)/0.089))/(1+EXP(VLOOKUP(D6-0.5,coeff!$F$3:$H$74,2,FALSE)+VLOOKUP(D6-0.5,coeff!$F$3:$H$74,3,FALSE)*(LN(1/(1-C6)-1)/0.089))))/2))","v":""},{"$f":"IF(D6=\"\",\"\",IF((G6*E6-1)>=0.05,coeff!$C$5/coeff!$B$5*(G6*E6-1)/(E6-1),0))","v":""},{"$f":"IF(D6=\"\",\"\",IF((F6*(1-G6)-1)>=0.05,coeff!$C$5/coeff!$B$5*(F6*(1-G6)-1)/(F6-1),0))","v":""},""]
[null,null,{"$f":"IF(h2h!C7=\"\",\"\",h2h!C7)","v":""},null,null,null,{"$f":"IF(D7=\"\",\"\",IF(ISERROR(VLOOKUP(D7,coeff!$F$3:$H$74,2,FALSE))=FALSE,EXP(VLOOKUP(D7,coeff!$F$3:$H$74,2,FALSE)+VLOOKUP(D7,coeff!$F$3:$H$74,3,FALSE)*(LN(1/(1-C7)-1)/0.089))/(1+EXP(VLOOKUP(D7,coeff!$F$3:$H$74,2,FALSE)+VLOOKUP(D7,coeff!$F$3:$H$74,3,FALSE)*(LN(1/(1-C7)-1)/0.089))),(EXP(VLOOKUP(D7+0.5,coeff!$F$3:$H$74,2,FALSE)+VLOOKUP(D7+0.5,coeff!$F$3:$H$74,3,FALSE)*(LN(1/(1-C7)-1)/0.089))/(1+EXP(VLOOKUP(D7+0.5,coeff!$F$3:$H$74,2,FALSE)+VLOOKUP(D7+0.5,coeff!$F$3:$H$74,3,FALSE)*(LN(1/(1-C7)-1)/0.089)))+EXP(VLOOKUP(D7-0.5,coeff!$F$3:$H$74,2,FALSE)+VLOOKUP(D7-0.5,coeff!$F$3:$H$74,3,FALSE)*(LN(1/(1-C7)-1)/0.089))/(1+EXP(VLOOKUP(D7-0.5,coeff!$F$3:$H$74,2,FALSE)+VLOOKUP(D7-0.5,coeff!$F$3:$H$74,3,FALSE)*(LN(1/(1-C7)-1)/0.089))))/2))","v":""},{"$f":"IF(D7=\"\",\"\",IF((G7*E7-1)>=0.05,coeff!$C$5/coeff!$B$5*(G7*E7-1)/(E7-1),0))","v":""},{"$f":"IF(D7=\"\",\"\",IF((F7*(1-G7)-1)>=0.05,coeff!$C$5/coeff!$B$5*(F7*(1-G7)-1)/(F7-1),0))","v":""},""]
[null,null,{"$f":"IF(h2h!C8=\"\",\"\",h2h!C8)","v":""},null,null,null,{"$f":"IF(D8=\"\",\"\",IF(ISERROR(VLOOKUP(D8,coeff!$F$3:$H$74,2,FALSE))=FALSE,EXP(VLOOKUP(D8,coeff!$F$3:$H$74,2,FALSE)+VLOOKUP(D8,coeff!$F$3:$H$74,3,FALSE)*(LN(1/(1-C8)-1)/0.089))/(1+EXP(VLOOKUP(D8,coeff!$F$3:$H$74,2,FALSE)+VLOOKUP(D8,coeff!$F$3:$H$74,3,FALSE)*(LN(1/(1-C8)-1)/0.089))),(EXP(VLOOKUP(D8+0.5,coeff!$F$3:$H$74,2,FALSE)+VLOOKUP(D8+0.5,coeff!$F$3:$H$74,3,FALSE)*(LN(1/(1-C8)-1)/0.089))/(1+EXP(VLOOKUP(D8+0.5,coeff!$F$3:$H$74,2,FALSE)+VLOOKUP(D8+0.5,coeff!$F$3:$H$74,3,FALSE)*(LN(1/(1-C8)-1)/0.089)))+EXP(VLOOKUP(D8-0.5,coeff!$F$3:$H$74,2,FALSE)+VLOOKUP(D8-0.5,coeff!$F$3:$H$74,3,FALSE)*(LN(1/(1-C8)-1)/0.089))/(1+EXP(VLOOKUP(D8-0.5,coeff!$F$3:$H$74,2,FALSE)+VLOOKUP(D8-0.5,coeff!$F$3:$H$74,3,FALSE)*(LN(1/(1-C8)-1)/0.089))))/2))","v":""},{"$f":"IF(D8=\"\",\"\",IF((G8*E8-1)>=0.05,coeff!$C$5/coeff!$B$5*(G8*E8-1)/(E8-1),0))","v":""},{"$f":"IF(D8=\"\",\"\",IF((F8*(1-G8)-1)>=0.05,coeff!$C$5/coeff!$B$5*(F8*(1-G8)-1)/(F8-1),0))","v":""},""]
[null,null,{"$f":"IF(h2h!C9=\"\",\"\",h2h!C9)","v":""},null,null,null,{"$f":"IF(D9=\"\",\"\",IF(ISERROR(VLOOKUP(D9,coeff!$F$3:$H$74,2,FALSE))=FALSE,EXP(VLOOKUP(D9,coeff!$F$3:$H$74,2,FALSE)+VLOOKUP(D9,coeff!$F$3:$H$74,3,FALSE)*(LN(1/(1-C9)-1)/0.089))/(1+EXP(VLOOKUP(D9,coeff!$F$3:$H$74,2,FALSE)+VLOOKUP(D9,coeff!$F$3:$H$74,3,FALSE)*(LN(1/(1-C9)-1)/0.089))),(EXP(VLOOKUP(D9+0.5,coeff!$F$3:$H$74,2,FALSE)+VLOOKUP(D9+0.5,coeff!$F$3:$H$74,3,FALSE)*(LN(1/(1-C9)-1)/0.089))/(1+EXP(VLOOKUP(D9+0.5,coeff!$F$3:$H$74,2,FALSE)+VLOOKUP(D9+0.5,coeff!$F$3:$H$74,3,FALSE)*(LN(1/(1-C9)-1)/0.089)))+EXP(VLOOKUP(D9-0.5,coeff!$F$3:$H$74,2,FALSE)+VLOOKUP(D9-0.5,coeff!$F$3:$H$74,3,FALSE)*(LN(1/(1-C9)-1)/0.089))/(1+EXP(VLOOKUP(D9-0.5,coeff!$F$3:$H$74,2,FALSE)+VLOOKUP(D9-0.5,coeff!$F$3:$H$74,3,FALSE)*(LN(1/(1-C9)-1)/0.089))))/2))","v":""},{"$f":"IF(D9=\"\",\"\",IF((G9*E9-1)>=0.05,coeff!$C$5/coeff!$B$5*(G9*E9-1)/(E9-1),0))","v":""},{"$f":"IF(D9=\"\",\"\",IF((F9*(1-G9)-1)>=0.05,coeff!$C$5/coeff!$B$5*(F9*(1-G9)-1)/(F9-1),0))","v":""},""]
[null,null,{"$f":"IF(h2h!C10=\"\",\"\",h2h!C10)","v":""},null,null,null,{"$f":"IF(D10=\"\",\"\",IF(ISERROR(VLOOKUP(D10,coeff!$F$3:$H$74,2,FALSE))=FALSE,EXP(VLOOKUP(D10,coeff!$F$3:$H$74,2,FALSE)+VLOOKUP(D10,coeff!$F$3:$H$74,3,FALSE)*(LN(1/(1-C10)-1)/0.089))/(1+EXP(VLOOKUP(D10,coeff!$F$3:$H$74,2,FALSE)+VLOOKUP(D10,coeff!$F$3:$H$74,3,FALSE)*(LN(1/(1-C10)-1)/0.089))),(EXP(VLOOKUP(D10+0.5,coeff!$F$3:$H$74,2,FALSE)+VLOOKUP(D10+0.5,coeff!$F$3:$H$74,3,FALSE)*(LN(1/(1-C10)-1)/0.089))/(1+EXP(VLOOKUP(D10+0.5,coeff!$F$3:$H$74,2,FALSE)+VLOOKUP(D10+0.5,coeff!$F$3:$H$74,3,FALSE)*(LN(1/(1-C10)-1)/0.089)))+EXP(VLOOKUP(D10-0.5,coeff!$F$3:$H$74,2,FALSE)+VLOOKUP(D10-0.5,coeff!$F$3:$H$74,3,FALSE)*(LN(1/(1-C10)-1)/0.089))/(1+EXP(VLOOKUP(D10-0.5,coeff!$F$3:$H$74,2,FALSE)+VLOOKUP(D10-0.5,coeff!$F$3:$H$74,3,FALSE)*(LN(1/(1-C10)-1)/0.089))))/2))","v":""},{"$f":"IF(D10=\"\",\"\",IF((G10*E10-1)>=0.05,coeff!$C$5/coeff!$B$5*(G10*E10-1)/(E10-1),0))","v":""},{"$f":"IF(D10=\"\",\"\",IF((F10*(1-G10)-1)>=0.05,coeff!$C$5/coeff!$B$5*(F10*(1-G10)-1)/(F10-1),0))","v":""},""]
{"$rows_left_out":8}
{"sheet":"multiple Lines","index":3,"n_rows":64,"n_cols":11,"rows_kept":64,"cut":false,"hidden":false,"merged":[]}
[]
["Team1","Team2","PlayerProb","Line","Odds1","Odds2","LineProb","$Bet1","$Bet2","Exp Profit","Max"]
[{"$f":"line!A4","v":"Penrith"},{"$f":"line!B4","v":"Canterbury"},{"$f":"IF(line!C4=\"\",\"\",line!C4)","v":0.50600000000000001},5,1.92,1.99,{"$f":"IF(OR(C3=\"\",D3=\"\"),\"\",IF(ISERROR(VLOOKUP(D3,coeff!$F$3:$H$74,2,FALSE))=FALSE,EXP(VLOOKUP(D3,coeff!$F$3:$H$74,2,FALSE)+VLOOKUP(D3,coeff!$F$3:$H$74,3,FALSE)*(LN(1/(1-C3)-1)/0.089))/(1+EXP(VLOOKUP(D3,coeff!$F$3:$H$74,2,FALSE)+VLOOKUP(D3,coeff!$F$3:$H$74,3,FALSE)*(LN(1/(1-C3)-1)/0.089))),(EXP(VLOOKUP(D3+0.5,coeff!$F$3:$H$74,2,FALSE)+VLOOKUP(D3+0.5,coeff!$F$3:$H$74,3,FALSE)*(LN(1/(1-C3)-1)/0.089))/(1+EXP(VLOOKUP(D3+0.5,coeff!$F$3:$H$74,2,FALSE)+VLOOKUP(D3+0.5,coeff!$F$3:$H$74,3,FALSE)*(LN(1/(1-C3)-1)/0.089)))+EXP(VLOOKUP(D3-0.5,coeff!$F$3:$H$74,2,FALSE)+VLOOKUP(D3-0.5,coeff!$F$3:$H$74,3,FALSE)*(LN(1/(1-C3)-1)/0.089))/(1+EXP(VLOOKUP(D3-0.5,coeff!$F$3:$H$74,2,FALSE)+VLOOKUP(D3-0.5,coeff!$F$3:$H$74,3,FALSE)*(LN(1/(1-C3)-1)/0.089))))/2))","v":0.6304730828549816},{"$f":"IF(OR(C3=\"\",D3=\"\"),\"\",IF(AND((G3*E3-1)>=0.05,K3=1),coeff!$C$5/coeff!$B$5*(G3*E3-1)/(E3-1),0))","v":0},{"$f":"IF(OR(C3=\"\",D3=\"\"),\"\",IF(AND((F3*(1-G3)-1)>=0.05,K3=1),coeff!$C$5/coeff!$B$5*(F3*(1-G3)-1)/(F3-1),0))","v":0},{"$f":"IF(OR(C3=\"\",D3=\"\"),\"\",IF((G3*E3-1)>0,1000*(G3*E3-1)/(E3-1)*G3*(E3-1)-(1-G3)*1000*(G3*E3-1)/(E3-1),IF(((1-G3)*F3-1)>0,1000*((1-G3)*F3-1)/(F3-1)*(1-G3)*(F3-1)-G3*1000*((1-G3)*F3-1)/(F3-1),0)))","v":48.16712217668028},{"$f":"IF(J3=MAX($J$3:$J$8),1,0)","v":0}]
[null,null,{"$f":"C3","v":0.50600000000000001},5.5,1.89,2.1,{"$f":"IF(OR(C4=\"\",D4=\"\"),\"\",IF(ISERROR(VLOOKUP(D4,coeff!$F$3:$H$74,2,FALSE))=FALSE,EXP(VLOOKUP(D4,coeff!$F$3:$H$74,2,FALSE)+VLOOKUP(D4,coeff!$F$3:$H$74,3,FALSE)*(LN(1/(1-C4)-1)/0.089))/(1+EXP(VLOOKUP(D4,coeff!$F$3:$H$74,2,FALSE)+VLOOKUP(D4,coeff!$F$3:$H$74,3,FALSE)*(LN(1/(1-C4)-1)/0.089))),(EXP(VLOOKUP(D4+0.5,coeff!$F$3:$H$74,2,FALSE)+VLOOKUP(D4+0.5,coeff!$F$3:$H$74,3,FALSE)*(LN(1/(1-C4)-1)/0.089))/(1+EXP(VLOOKUP(D4+0.5,coeff!$F$3:$H$74,2,FALSE)+VLOOKUP(D4+0.5,coeff!$F$3:$H$74,3,FALSE)*(LN(1/(1-C4)-1)/0.089)))+EXP(VLOOKUP(D4-0.5,coeff!$F$3:$H$74,2,FALSE)+VLOOKUP(D4-0.5,coeff!$F$3:$H$74,3,FALSE)*(LN(1/(1-C4)-1)/0.089))/(1+EXP(VLOOKUP(D4-0.5,coeff!$F$3:$H$74,2,FALSE)+VLOOKUP(D4-0.5,coeff!$F$3:$H$74,3,FALSE)*(LN(1/(1-C4)-1)/0.089))))/2))","v":0.63205999374036437},{"$f":"IF(OR(C4=\"\",D4=\"\"),\"\",IF(AND((G4*E4-1)>=0.05,K4=1),coeff!$C$5/coeff!$B$5*(G4*E4-1)/(E4-1),0))","v":0},{"$f":"IF(OR(C4=\"\",D4=\"\"),\"\",IF(AND((F4*(1-G4)-1)>=0.05,K4=1),coeff!$C$5/coeff!$B$5*(F4*(1-G4)-1)/(F4-1),0))","v":0},{"$f":"IF(OR(C4=\"\",D4=\"\"),\"\",IF((G4*E4-1)>0,1000*(G4*E4-1)/(E4-1)*G4*(E4-1)-(1-G4)*1000*(G4*E4-1)/(E4-1),IF(((1-G4)*F4-1)>0,1000*((1-G4)*F4-1)/(F4-1)*(1-G4)*(F4-1)-G4*1000*((1-G4)*F4-1)/(F4-1),0)))","v":42.546726650790347},{"$f":"IF(J4=MAX($J$3:$J$8),1,0)","v":0}]
[null,null,{"$f":"C4","v":0.50600000000000001},6,2.0499999999999998,2.1,{"$f":"IF(OR(C5=\"\",D5=\"\"),\"\",IF(ISERROR(VLOOKUP(D5,coeff!$F$3:$H$74,2,FALSE))=FALSE,EXP(VLOOKUP(D5,coeff!$F$3:$H$74,2,FALSE)+VLOOKUP(D5,coeff!$F$3:$H$74,3,FALSE)*(LN(1/(1-C5)-1)/0.089))/(1+EXP(VLOOKUP(D5,coeff!$F$3:$H$74,2,FALSE)+VLOOKUP(D5,coeff!$F$3:$H$74,3,FALSE)*(LN(1/(1-C5)-1)/0.089))),(EXP(VLOOKUP(D5+0.5,coeff!$F$3:$H$74,2,FALSE)+VLOOKUP(D5+0.5,coeff!$F$3:$H$74,3,FALSE)*(LN(1/(1-C5)-1)/0.089))/(1+EXP(VLOOKUP(D5+0.5,coeff!$F$3:$H$74,2,FALSE)+VLOOKUP(D5+0.5,coeff!$F$3:$H$74,3,FALSE)*(LN(1/(1-C5)-1)/0.089)))+EXP(VLOOKUP(D5-0.5,coeff!$F$3:$H$74,2,FALSE)+VLOOKUP(D5-0.5,coeff!$F$3:$H$74,3,FALSE)*(LN(1/(1-C5)-1)/0.089))/(1+EXP(VLOOKUP(D5-0.5,coeff!$F$3:$H$74,2,FALSE)+VLOOKUP(D5-0.5,coeff!$F$3:$H$74,3,FALSE)*(LN(1/(1-C5)-1)/0.089))))/2))","v":0.64894643622790338},{"$f":"IF(OR(C5=\"\",D5=\"\"),\"\",IF(AND((G5*E5-1)>=0.05,K5=1),coeff!$C$5/coeff!$B$5*(G5*E5-1)/(E5-1),0))","v":0},{"$f":"IF(OR(C5=\"\",D5=\"\"),\"\",IF(AND((F5*(1-G5)-1)>=0.05,K5=1),coeff!$C$5/coeff!$B$5*(F5*(1-G5)-1)/(F5-1),0))","v":0},103.92823233189776,0]
[null,null,0.50600000000000001,6.5,2,1.91,{"$f":"IF(OR(C6=\"\",D6=\"\"),\"\",IF(ISERROR(VLOOKUP(D6,coeff!$F$3:$H$74,2,FALSE))=FALSE,EXP(VLOOKUP(D6,coeff!$F$3:$H$74,2,FALSE)+VLOOKUP(D6,coeff!$F$3:$H$74,3,FALSE)*(LN(1/(1-C6)-1)/0.089))/(1+EXP(VLOOKUP(D6,coeff!$F$3:$H$74,2,FALSE)+VLOOKUP(D6,coeff!$F$3:$H$74,3,FALSE)*(LN(1/(1-C6)-1)/0.089))),(EXP(VLOOKUP(D6+0.5,coeff!$F$3:$H$74,2,FALSE)+VLOOKUP(D6+0.5,coeff!$F$3:$H$74,3,FALSE)*(LN(1/(1-C6)-1)/0.089))/(1+EXP(VLOOKUP(D6+0.5,coeff!$F$3:$H$74,2,FALSE)+VLOOKUP(D6+0.5,coeff!$F$3:$H$74,3,FALSE)*(LN(1/(1-C6)-1)/0.089)))+EXP(VLOOKUP(D6-0.5,coeff!$F$3:$H$74,2,FALSE)+VLOOKUP(D6-0.5,coeff!$F$3:$H$74,3,FALSE)*(LN(1/(1-C6)-1)/0.089))/(1+EXP(VLOOKUP(D6-0.5,coeff!$F$3:$H$74,2,FALSE)+VLOOKUP(D6-0.5,coeff!$F$3:$H$74,3,FALSE)*(LN(1/(1-C6)-1)/0.089))))/2))","v":0.66583287871544228},{"$f":"IF(OR(C6=\"\",D6=\"\"),\"\",IF(AND((G6*E6-1)>=0.05,K6=1),coeff!$C$5/coeff!$B$5*(G6*E6-1)/(E6-1),0))","v":0},{"$f":"IF(OR(C6=\"\",D6=\"\"),\"\",IF(AND((F6*(1-G6)-1)>=0.05,K6=1),coeff!$C$5/coeff!$B$5*(F6*(1-G6)-1)/(F6-1),0))","v":0},110.00217465220238,0]
[null,null,0.50600000000000001,7,2,1.91,{"$f":"IF(OR(C7=\"\",D7=\"\"),\"\",IF(ISERROR(VLOOKUP(D7,coeff!$F$3:$H$74,2,FALSE))=FALSE,EXP(VLOOKUP(D7,coeff!$F$3:$H$74,2,FALSE)+VLOOKUP(D7,coeff!$F$3:$H$74,3,FALSE)*(LN(1/(1-C7)-1)/0.089))/(1+EXP(VLOOKUP(D7,coeff!$F$3:$H$74,2,FALSE)+VLOOKUP(D7,coeff!$F$3:$H$74,3,FALSE)*(LN(1/(1-C7)-1)/0.089))),(EXP(VLOOKUP(D7+0.5,coeff!$F$3:$H$74,2,FALSE)+VLOOKUP(D7+0.5,coeff!$F$3:$H$74,3,FALSE)*(LN(1/(1-C7)-1)/0.089))/(1+EXP(VLOOKUP(D7+0.5,coeff!$F$3:$H$74,2,FALSE)+VLOOKUP(D7+0.5,coeff!$F$3:$H$74,3,FALSE)*(LN(1/(1-C7)-1)/0.089)))+EXP(VLOOKUP(D7-0.5,coeff!$F$3:$H$74,2,FALSE)+VLOOKUP(D7-0.5,coeff!$F$3:$H$74,3,FALSE)*(LN(1/(1-C7)-1)/0.089))/(1+EXP(VLOOKUP(D7-0.5,coeff!$F$3:$H$74,2,FALSE)+VLOOKUP(D7-0.5,coeff!$F$3:$H$74,3,FALSE)*(LN(1/(1-C7)-1)/0.089))))/2))","v":0.67287786037300434},{"$f":"IF(OR(C7=\"\",D7=\"\"),\"\",IF(AND((G7*E7-1)>=0.05,K7=1),coeff!$C$5/coeff!$B$5*(G7*E7-1)/(E7-1),0))","v":345.75572074600871},{"$f":"IF(OR(C7=\"\",D7=\"\"),\"\",IF(AND((F7*(1-G7)-1)>=0.05,K7=1),coeff!$C$5/coeff!$B$5*(F7*(1-G7)-1)/(F7-1),0))","v":0},119.54701842859197,1]
[null,null,0.50600000000000001,7,2,1.91,{"$f":"IF(OR(C8=\"\",D8=\"\"),\"\",IF(ISERROR(VLOOKUP(D8,coeff!$F$3:$H$74,2,FALSE))=FALSE,EXP(VLOOKUP(D8,coeff!$F$3:$H$74,2,FALSE)+VLOOKUP(D8,coeff!$F$3:$H$74,3,FALSE)*(LN(1/(1-C8)-1)/0.089))/(1+EXP(VLOOKUP(D8,coeff!$F$3:$H$74,2,FALSE)+VLOOKUP(D8,coeff!$F$3:$H$74,3,FALSE)*(LN(1/(1-C8)-1)/0.089))),(EXP(VLOOKUP(D8+0.5,coeff!$F$3:$H$74,2,FALSE)+VLOOKUP(D8+0.5,coeff!$F$3:$H$74,3,FALSE)*(LN(1/(1-C8)-1)/0.089))/(1+EXP(VLOOKUP(D8+0.5,coeff!$F$3:$H$74,2,FALSE)+VLOOKUP(D8+0.5,coeff!$F$3:$H$74,3,FALSE)*(LN(1/(1-C8)-1)/0.089)))+EXP(VLOOKUP(D8-0.5,coeff!$F$3:$H$74,2,FALSE)+VLOOKUP(D8-0.5,coeff!$F$3:$H$74,3,FALSE)*(LN(1/(1-C8)-1)/0.089))/(1+EXP(VLOOKUP(D8-0.5,coeff!$F$3:$H$74,2,FALSE)+VLOOKUP(D8-0.5,coeff!$F$3:$H$74,3,FALSE)*(LN(1/(1-C8)-1)/0.089))))/2))","v":0.67287786037300434},{"$f":"IF(OR(C8=\"\",D8=\"\"),\"\",IF(AND((G8*E8-1)>=0.05,K8=1),coeff!$C$5/coeff!$B$5*(G8*E8-1)/(E8-1),0))","v":345.75572074600871},{"$f":"IF(OR(C8=\"\",D8=\"\"),\"\",IF(AND((F8*(1-G8)-1)>=0.05,K8=1),coeff!$C$5/coeff!$B$5*(F8*(1-G8)-1)/(F8-1),0))","v":0},119.54701842859197,1]
[]
["Team1","Team2","PlayerProb","Line","Odds1","Odds2","LineProb","$Bet1","$Bet2","Exp Profit","Max"]
{"$rows_left_out":55}
{"sheet":"totals","index":4,"n_rows":5,"n_cols":9,"rows_kept":5,"cut":false,"hidden":false,"merged":[]}
[]
[]
["Team1","Team2","TotalLine","OddsOver","OddsUnder","ProbOver","$BetOver","$BetUnder","Overlay"]
["Penrith","Canterbury",4.5,1.77,2.11,{"$f":"IF(C4=\"\",\"\",IF(ISERROR(VLOOKUP(C4,coeff!$F$3:$H$74,2,FALSE))=FALSE,EXP(VLOOKUP(C4,coeff!$F$3:$H$74,2,FALSE)+VLOOKUP(C4,coeff!$F$3:$H$74,3,FALSE)*(LN(1/(1-#REF!)-1)/0.089))/(1+EXP(VLOOKUP(C4,coeff!$F$3:$H$74,2,FALSE)+VLOOKUP(C4,coeff!$F$3:$H$74,3,FALSE)*(LN(1/(1-#REF!)-1)/0.089))),(EXP(VLOOKUP(C4+0.5,coeff!$F$3:$H$74,2,FALSE)+VLOOKUP(C4+0.5,coeff!$F$3:$H$74,3,FALSE)*(LN(1/(1-#REF!)-1)/0.089))/(1+EXP(VLOOKUP(C4+0.5,coeff!$F$3:$H$74,2,FALSE)+VLOOKUP(C4+0.5,coeff!$F$3:$H$74,3,FALSE)*(LN(1/(1-#REF!)-1)/0.089)))+EXP(VLOOKUP(C4-0.5,coeff!$F$3:$H$74,2,FALSE)+VLOOKUP(C4-0.5,coeff!$F$3:$H$74,3,FALSE)*(LN(1/(1-#REF!)-1)/0.089))/(1+EXP(VLOOKUP(C4-0.5,coeff!$F$3:$H$74,2,FALSE)+VLOOKUP(C4-0.5,coeff!$F$3:$H$74,3,FALSE)*(LN(1/(1-#REF!)-1)/0.089))))/2))","v":{"$error":"#REF!"}},{"$f":"IF(C4=\"\",\"\",IF((F4*D4-1)>=0.05,coeff!$C$5/coeff!$B$5*(F4*D4-1)/(D4-1),0))","v":{"$error":"#REF!"}},{"$f":"IF(C4=\"\",\"\",IF((E4*(1-F4)-1)>=0.05,coeff!$C$5/coeff!$B$5*(E4*(1-F4)-1)/(E4-1),0))","v":{"$error":"#REF!"}},{"$f":"IF(#REF!=\"\",\"\",IF(G4>0,D4*F4-1,IF(H4>0,E4*(1-F4)-1,\"\")))","v":{"$error":"#REF!"}}]
["Brisbane","New Zealand",-9.5,1.93,1.93,{"$f":"IF(C5=\"\",\"\",IF(ISERROR(VLOOKUP(C5,coeff!$F$3:$H$74,2,FALSE))=FALSE,EXP(VLOOKUP(C5,coeff!$F$3:$H$74,2,FALSE)+VLOOKUP(C5,coeff!$F$3:$H$74,3,FALSE)*(LN(1/(1-#REF!)-1)/0.089))/(1+EXP(VLOOKUP(C5,coeff!$F$3:$H$74,2,FALSE)+VLOOKUP(C5,coeff!$F$3:$H$74,3,FALSE)*(LN(1/(1-#REF!)-1)/0.089))),(EXP(VLOOKUP(C5+0.5,coeff!$F$3:$H$74,2,FALSE)+VLOOKUP(C5+0.5,coeff!$F$3:$H$74,3,FALSE)*(LN(1/(1-#REF!)-1)/0.089))/(1+EXP(VLOOKUP(C5+0.5,coeff!$F$3:$H$74,2,FALSE)+VLOOKUP(C5+0.5,coeff!$F$3:$H$74,3,FALSE)*(LN(1/(1-#REF!)-1)/0.089)))+EXP(VLOOKUP(C5-0.5,coeff!$F$3:$H$74,2,FALSE)+VLOOKUP(C5-0.5,coeff!$F$3:$H$74,3,FALSE)*(LN(1/(1-#REF!)-1)/0.089))/(1+EXP(VLOOKUP(C5-0.5,coeff!$F$3:$H$74,2,FALSE)+VLOOKUP(C5-0.5,coeff!$F$3:$H$74,3,FALSE)*(LN(1/(1-#REF!)-1)/0.089))))/2))","v":{"$error":"#REF!"}},{"$f":"IF(C5=\"\",\"\",IF((F5*D5-1)>=0.05,coeff!$C$5/coeff!$B$5*(F5*D5-1)/(D5-1),0))","v":{"$error":"#REF!"}},{"$f":"IF(C5=\"\",\"\",IF((E5*(1-F5)-1)>=0.05,coeff!$C$5/coeff!$B$5*(E5*(1-F5)-1)/(E5-1),0))","v":{"$error":"#REF!"}},{"$f":"IF(#REF!=\"\",\"\",IF(G5>0,D5*F5-1,IF(H5>0,E5*(1-F5)-1,\"\")))","v":{"$error":"#REF!"}}]

{"sheet":"futures","index":5,"n_rows":19,"n_cols":4,"rows_kept":19,"cut":false,"hidden":false,"merged":[]}
["Sportpunter's NRL Betting Predictions as at 10/03/2016"]
[]
["Team","P(Prem)","P(Finals)","P(Spoon)"]
["South Sydney Rabbitohs",0.11799999999999999,0.74099999999999999,1.2999999999999999E-2]
["Canterbury Bulldogs",9.0999999999999998E-2,0.66700000000000004,1.4999999999999999E-2]
["Gold Coast Titans",2.1000000000000001E-2,0.35699999999999998,9.0999999999999998E-2]
["Brisbane Broncos",0.14899999999999999,0.79400000000000004,2E-3]
["Canberra Raiders",3.7999999999999999E-2,0.47599999999999998,0.05]
["Wests Tigers",2.8000000000000001E-2,0.37,6.9000000000000006E-2]
["North Queensland Cowboys",0.14099999999999999,0.78100000000000003,6.0000000000000001E-3]
{"$rows_left_out":10}
{"sheet":"Sheet1","index":6,"n_rows":12,"n_cols":12,"rows_kept":12,"cut":false,"hidden":false,"merged":[]}
["Sportpunter's NRL Suggested Bets as at 27/03/2015"]
[]
["Team1","Team2","Venue","Prob"," Odds1 "," Odds2 "," Overlay1 "," Overlay2 "," Bet1 "," Bet2 "," Result "," Profit/Loss "]
["Parramatta","South Sydney","Pirtek Stadium",0.23699999999999999,3.59,1.34,0,0.02," $                 -  "," $                 -  ",null,"  "]
["Wests","Canterbury","ANZ Stadium",0.20200000000000001,3.52,1.35,0,0.08," $                 -  ",220.66,null,"  "]
["Newcastle","Penrith","Hunter Stadium",0.38600000000000001,2.1,1.83,0,0.12," $                 -  ",148.65,null,"  "]
["Cronulla","Gold Coast","Remondis Stadium",0.876,1.46,2.93,0.28000000000000003,0,607.78," $                 -  ",null,"  "]
["St. George Illawarra","Manly","WIN Jubilee",0.36899999999999999,2.4700000000000002,1.61,0,0.02," $                 -  "," $                 -  ",null,"  "]
["New Zealand","Brisbane","Mt. Smart Stadium",0.48699999999999999,1.75,2.2000000000000002,0,0.13," $                 -  ",106.32,null,"  "]
["Sydney","Canberra","Allianz Stadium",0.82299999999999995,1.17,5.98,0,0.06," $                 -  ",11.68,null,"  "]
{"$rows_left_out":3}
{"sheet":"Sheet4","index":7,"n_rows":8,"n_cols":4,"rows_kept":8,"cut":false,"hidden":false,"merged":[]}
["h2hbets_2: Failed ..."]
[]
[]
[]
[]
[]
[]
[null,null,null,"h2hbets: Failed ..."]

{"sheet":"Sheet3","index":8,"n_rows":1,"n_cols":1,"rows_kept":1,"cut":false,"hidden":false,"merged":[]}
["h2hbets: Failed ..."]