{"text_format":"1","workbook":"xlsx","n_sheets":2,"sheets":["settings","mlb"],"not_rendered":{"charts":0,"images":0,"macros":1,"external_links":0,"defined_names":6,"comments":0,"pivot_tables":0},"unopened":[],"bounds":{"document_bytes":16777216,"sheet_cells":100000,"rows_first":2000,"rows_last":500,"rows_between":2000,"halvings":0,"cell_chars":16384,"cell_head_chars":4096},"cells_cut":0,"cells_raw":0,"read":"whole","date_system":"1900"}

{"sheet":"settings","index":0,"n_rows":23,"n_cols":8,"rows_kept":23,"cut":false,"hidden":false,"merged":[]}
[]
["Bank",10000,null,null,null,"Totals Coeff","Intercept","Exp"]
[null,null,null,null,null,4,-1.0504124038270131,0.36406360827180945]
["Kelly",null,null,null,null,{"$f":"F3+0.5","v":4.5},-1.1404799430191728,0.32703934208839658]
["h2h",10,null,null,null,{"$f":"F4+0.5","v":5},-1.5262370987345417,0.3556521158684125]
["totals",10,null,null,null,5.5,-1.5645585807156901,0.29945074305014585]
[null,null,null,null,null,6,-1.9555592995640019,0.33106230145559018]
["Min.Overlay",null,null,null,null,6.5,-2.0554881003778283,0.31204066707183203]
["Team1",0.05,null,null,null,7,-2.500200145067224,0.33974309241361556]
["Team2",0.05,null,null,null,7.5,-2.4617909613032665,0.30052133055823038]
[null,null,null,null,null,8,-2.892051670508232,0.3306477457720105]
["Over",0.05,null,null,null,8.5,-2.8945765295099477,0.31208171672732476]
["Under",0.05,null,null,null,9,-3.568734305359031,0.36091762312988551]
[null,null,null,null,null,9.5,-3.5691456440948435,0.34176508991475074]
[null,null,null,null,null,10,-4.0648972131158967,0.37441089518115739]
[null,null,null,null,null,10.5,-3.9969437852416689,0.35504629993971798]
[null,null,null,null,null,11,-4.6535481776868455,0.39689733676801719]
[null,null,null,null,null,11.5,-4.5173021906864319,0.36985291129553999]
[null,null,null,null,null,12,-4.8003222310939817,0.37711934798121766]
[null,null,null,null,null,12.5,-4.6450291262997077,0.35287636388846444]
{"$rows_left_out":4}
{"sheet":"mlb","index":1,"n_rows":40,"n_cols":17,"rows_kept":40,"cut":false,"hidden":false,"merged":[]}
[]
[]
["Date","Team1","Team2","Pitcher1","Pitcher2","Prob(Team1)","ExpTot","Odds1","Odds2","$Bet1","$Bet2","Prob(Over)","Tot Line","OddsOver","OddsUnder","$BetOver","$BetUnder"]
["2014-05-25","Oakland","Toronto","Drew Pomeranz","J.A. Happ",0.54600000000000004,9.6999999999999993,1.85,2.09,{"$f":"IF(OR(F4=\"\",H4=\"\"),\"\",IF((F4*H4-1)>=settings!$B$9,settings!$B$2/settings!$B$5*(F4*H4-1)/(mlb!H4-1),0))","v":0},{"$f":"IF(OR(F4=\"\",I4=\"\"),\"\",IF(((1-F4)*I4-1)>=settings!$B$10,settings!$B$2/settings!$B$5*((1-F4)*I4-1)/(I4-1),0))","v":0},{"$f":"IF(OR(G4=\"\",M4=\"\"),\"\",EXP(VLOOKUP(M4,settings!$F$3:$H$23,2)+VLOOKUP(M4,settings!$F$3:$H$23,3)*G4)/(1+EXP(VLOOKUP(M4,settings!$F$3:$H$23,2)+VLOOKUP(M4,settings!$F$3:$H$23,3)*G4)))","v":0.43683323775086524},9.5,1.99,1.92,{"$f":"IF(OR(M4=\"\",L4=\"\",N4=\"\",G4=\"\"),\"\",IF((L4*N4-1)>=settings!$B$12,settings!$B$2/settings!$B$6*(L4*N4-1)/(N4-1),0))","v":0},{"$f":"IF(OR(M4=\"\",L4=\"\",O4=\"\",G4=\"\"),\"\",IF(((1-L4)*O4-1)>=settings!$B$13,settings!$B$2/settings!$B$6*((1-L4)*O4-1)/(O4-1),0))","v":88.348025563411696}]
["2014-05-25","Texas","Detroit","Colby Lewis","Justin Verlander",0.42599999999999999,8,2.56,1.59,{"$f":"IF(OR(F5=\"\",H5=\"\"),\"\",IF((F5*H5-1)>=settings!$B$9,settings!$B$2/settings!$B$5*(F5*H5-1)/(mlb!H5-1),0))","v":58.05128205128203},{"$f":"IF(OR(F5=\"\",I5=\"\"),\"\",IF(((1-F5)*I5-1)>=settings!$B$10,settings!$B$2/settings!$B$5*((1-F5)*I5-1)/(I5-1),0))","v":0},{"$f":"IF(OR(G5=\"\",M5=\"\"),\"\",EXP(VLOOKUP(M5,settings!$F$3:$H$23,2)+VLOOKUP(M5,settings!$F$3:$H$23,3)*G5)/(1+EXP(VLOOKUP(M5,settings!$F$3:$H$23,2)+VLOOKUP(M5,settings!$F$3:$H$23,3)*G5)))","v":0.43859412092460892},8,1.89,1.98,{"$f":"IF(OR(M5=\"\",L5=\"\",N5=\"\",G5=\"\"),\"\",IF((L5*N5-1)>=settings!$B$12,settings!$B$2/settings!$B$6*(L5*N5-1)/(N5-1),0))","v":0},{"$f":"IF(OR(M5=\"\",L5=\"\",O5=\"\",G5=\"\"),\"\",IF(((1-L5)*O5-1)>=settings!$B$13,settings!$B$2/settings!$B$6*((1-L5)*O5-1)/(O5-1),0))","v":113.86085772374926}]
["2014-05-25","Arizona","NY Mets","Bronson Arroyo","Rafael Montero",0.46400000000000002,7.8,1.94,1.98,{"$f":"IF(OR(F6=\"\",H6=\"\"),\"\",IF((F6*H6-1)>=settings!$B$9,settings!$B$2/settings!$B$5*(F6*H6-1)/(mlb!H6-1),0))","v":0},{"$f":"IF(OR(F6=\"\",I6=\"\"),\"\",IF(((1-F6)*I6-1)>=settings!$B$10,settings!$B$2/settings!$B$5*((1-F6)*I6-1)/(I6-1),0))","v":62.530612244897959},{"$f":"IF(OR(G6=\"\",M6=\"\"),\"\",EXP(VLOOKUP(M6,settings!$F$3:$H$23,2)+VLOOKUP(M6,settings!$F$3:$H$23,3)*G6)/(1+EXP(VLOOKUP(M6,settings!$F$3:$H$23,2)+VLOOKUP(M6,settings!$F$3:$H$23,3)*G6)))","v":0.53737912473293625},7,1.89,1.97,{"$f":"IF(OR(M6=\"\",L6=\"\",N6=\"\",G6=\"\"),\"\",IF((L6*N6-1)>=settings!$B$12,settings!$B$2/settings!$B$6*(L6*N6-1)/(N6-1),0))","v":0},{"$f":"IF(OR(M6=\"\",L6=\"\",O6=\"\",G6=\"\"),\"\",IF(((1-L6)*O6-1)>=settings!$B$13,settings!$B$2/settings!$B$6*((1-L6)*O6-1)/(O6-1),0))","v":0}]
["2014-05-25","Milwaukee","Miami","Jimmy Nelson","Randy Wolf",0.47599999999999998,8,1.88,2.04,{"$f":"IF(OR(F7=\"\",H7=\"\"),\"\",IF((F7*H7-1)>=settings!$B$9,settings!$B$2/settings!$B$5*(F7*H7-1)/(mlb!H7-1),0))","v":0},{"$f":"IF(OR(F7=\"\",I7=\"\"),\"\",IF(((1-F7)*I7-1)>=settings!$B$10,settings!$B$2/settings!$B$5*((1-F7)*I7-1)/(I7-1),0))","v":66.307692307692434},{"$f":"IF(OR(G7=\"\",M7=\"\"),\"\",EXP(VLOOKUP(M7,settings!$F$3:$H$23,2)+VLOOKUP(M7,settings!$F$3:$H$23,3)*G7)/(1+EXP(VLOOKUP(M7,settings!$F$3:$H$23,2)+VLOOKUP(M7,settings!$F$3:$H$23,3)*G7)))","v":0.40181151269196275},8.5,1.93,1.94,{"$f":"IF(OR(M7=\"\",L7=\"\",N7=\"\",G7=\"\"),\"\",IF((L7*N7-1)>=settings!$B$12,settings!$B$2/settings!$B$6*(L7*N7-1)/(N7-1),0))","v":0},{"$f":"IF(OR(M7=\"\",L7=\"\",O7=\"\",G7=\"\"),\"\",IF(((1-L7)*O7-1)>=settings!$B$13,settings!$B$2/settings!$B$6*((1-L7)*O7-1)/(O7-1),0))","v":170.72943125275756}]
["2014-05-25","Cleveland","Baltimore","Trevor Bauer","Miguel Gonzalez",0.46700000000000003,8.8000000000000007,2.0699999999999998,1.86,{"$f":"IF(OR(F8=\"\",H8=\"\"),\"\",IF((F8*H8-1)>=settings!$B$9,settings!$B$2/settings!$B$5*(F8*H8-1)/(mlb!H8-1),0))","v":0},{"$f":"IF(OR(F8=\"\",I8=\"\"),\"\",IF(((1-F8)*I8-1)>=settings!$B$10,settings!$B$2/settings!$B$5*((1-F8)*I8-1)/(I8-1),0))","v":0},{"$f":"IF(OR(G8=\"\",M8=\"\"),\"\",EXP(VLOOKUP(M8,settings!$F$3:$H$23,2)+VLOOKUP(M8,settings!$F$3:$H$23,3)*G8)/(1+EXP(VLOOKUP(M8,settings!$F$3:$H$23,2)+VLOOKUP(M8,settings!$F$3:$H$23,3)*G8)))","v":0.40307731142603531},9,1.95,1.95,{"$f":"IF(OR(M8=\"\",L8=\"\",N8=\"\",G8=\"\"),\"\",IF((L8*N8-1)>=settings!$B$12,settings!$B$2/settings!$B$6*(L8*N8-1)/(N8-1),0))","v":0},{"$f":"IF(OR(M8=\"\",L8=\"\",O8=\"\",G8=\"\"),\"\",IF(((1-L8)*O8-1)>=settings!$B$13,settings!$B$2/settings!$B$6*((1-L8)*O8-1)/(O8-1),0))","v":172.63078180971704}]
["2014-05-25","LA Dodgers","Philadelphia","Josh Beckett","A.J. Burnett",0.54700000000000004,9.1,1.88,2.0499999999999998,{"$f":"IF(OR(F9=\"\",H9=\"\"),\"\",IF((F9*H9-1)>=settings!$B$9,settings!$B$2/settings!$B$5*(F9*H9-1)/(mlb!H9-1),0))","v":0},{"$f":"IF(OR(F9=\"\",I9=\"\"),\"\",IF(((1-F9)*I9-1)>=settings!$B$10,settings!$B$2/settings!$B$5*((1-F9)*I9-1)/(I9-1),0))","v":0},{"$f":"IF(OR(G9=\"\",M9=\"\"),\"\",EXP(VLOOKUP(M9,settings!$F$3:$H$23,2)+VLOOKUP(M9,settings!$F$3:$H$23,3)*G9)/(1+EXP(VLOOKUP(M9,settings!$F$3:$H$23,2)+VLOOKUP(M9,settings!$F$3:$H$23,3)*G9)))","v":0.5291775166743149},8,1.96,1.94,{"$f":"IF(OR(M9=\"\",L9=\"\",N9=\"\",G9=\"\"),\"\",IF((L9*N9-1)>=settings!$B$12,settings!$B$2/settings!$B$6*(L9*N9-1)/(N9-1),0))","v":0},{"$f":"IF(OR(M9=\"\",L9=\"\",O9=\"\",G9=\"\"),\"\",IF(((1-L9)*O9-1)>=settings!$B$13,settings!$B$2/settings!$B$6*((1-L9)*O9-1)/(O9-1),0))","v":0}]
["2014-05-25","Washington","Pittsburgh","Doug Fister","Francisco Liriano",0.45600000000000002,7.3,2.0699999999999998,1.86,{"$f":"IF(OR(F10=\"\",H10=\"\"),\"\",IF((F10*H10-1)>=settings!$B$9,settings!$B$2/settings!$B$5*(F10*H10-1)/(mlb!H10-1),0))","v":0},{"$f":"IF(OR(F10=\"\",I10=\"\"),\"\",IF(((1-F10)*I10-1)>=settings!$B$10,settings!$B$2/settings!$B$5*((1-F10)*I10-1)/(I10-1),0))","v":0},{"$f":"IF(OR(G10=\"\",M10=\"\"),\"\",EXP(VLOOKUP(M10,settings!$F$3:$H$23,2)+VLOOKUP(M10,settings!$F$3:$H$23,3)*G10)/(1+EXP(VLOOKUP(M10,settings!$F$3:$H$23,2)+VLOOKUP(M10,settings!$F$3:$H$23,3)*G10)))","v":0.49498127594432451},7,1.89,2.02,{"$f":"IF(OR(M10=\"\",L10=\"\",N10=\"\",G10=\"\"),\"\",IF((L10*N10-1)>=settings!$B$12,settings!$B$2/settings!$B$6*(L10*N10-1)/(N10-1),0))","v":0},{"$f":"IF(OR(M10=\"\",L10=\"\",O10=\"\",G10=\"\"),\"\",IF(((1-L10)*O10-1)>=settings!$B$13,settings!$B$2/settings!$B$6*((1-L10)*O10-1)/(O10-1),0))","v":0}]
["2014-05-25","Boston","Tampa Bay","Brandon Workman","Jake Odorizzi",0.495,8,2.08,1.85,{"$f":"IF(OR(F11=\"\",H11=\"\"),\"\",IF((F11*H11-1)>=settings!$B$9,settings!$B$2/settings!$B$5*(F11*H11-1)/(mlb!H11-1),0))","v":0},{"$f":"IF(OR(F11=\"\",I11=\"\"),\"\",IF(((1-F11)*I11-1)>=settings!$B$10,settings!$B$2/settings!$B$5*((1-F11)*I11-1)/(I11-1),0))","v":0},{"$f":"IF(OR(G11=\"\",M11=\"\"),\"\",EXP(VLOOKUP(M11,settings!$F$3:$H$23,2)+VLOOKUP(M11,settings!$F$3:$H$23,3)*G11)/(1+EXP(VLOOKUP(M11,settings!$F$3:$H$23,2)+VLOOKUP(M11,settings!$F$3:$H$23,3)*G11)))","v":0.43859412092460892},8,2.02,1.88,{"$f":"IF(OR(M11=\"\",L11=\"\",N11=\"\",G11=\"\"),\"\",IF((L11*N11-1)>=settings!$B$12,settings!$B$2/settings!$B$6*(L11*N11-1)/(N11-1),0))","v":0},{"$f":"IF(OR(M11=\"\",L11=\"\",O11=\"\",G11=\"\"),\"\",IF(((1-L11)*O11-1)>=settings!$B$13,settings!$B$2/settings!$B$6*((1-L11)*O11-1)/(O11-1),0))","v":63.003468933789897}]
["2014-05-25","NY Yankees","Chicago Sox","Masahiro Tanaka","Andre Rienzo",0.46800000000000003,9.1,1.59,2.56,{"$f":"IF(OR(F12=\"\",H12=\"\"),\"\",IF((F12*H12-1)>=settings!$B$9,settings!$B$2/settings!$B$5*(F12*H12-1)/(mlb!H12-1),0))","v":0},{"$f":"IF(OR(F12=\"\",I12=\"\"),\"\",IF(((1-F12)*I12-1)>=settings!$B$10,settings!$B$2/settings!$B$5*((1-F12)*I12-1)/(I12-1),0))","v":232},{"$f":"IF(OR(G12=\"\",M12=\"\"),\"\",EXP(VLOOKUP(M12,settings!$F$3:$H$23,2)+VLOOKUP(M12,settings!$F$3:$H$23,3)*G12)/(1+EXP(VLOOKUP(M12,settings!$F$3:$H$23,2)+VLOOKUP(M12,settings!$F$3:$H$23,3)*G12)))","v":0.56781775404883017},7.5,2.02,1.88,{"$f":"IF(OR(M12=\"\",L12=\"\",N12=\"\",G12=\"\"),\"\",IF((L12*N12-1)>=settings!$B$12,settings!$B$2/settings!$B$6*(L12*N12-1)/(N12-1),0))","v":144.10966978297733},{"$f":"IF(OR(M12=\"\",L12=\"\",O12=\"\",G12=\"\"),\"\",IF(((1-L12)*O12-1)>=settings!$B$13,settings!$B$2/settings!$B$6*((1-L12)*O12-1)/(O12-1),0))","v":0}]
["2014-05-25","Kansas City","LA Angels","Jason Vargas","Garrett Richards",0.45800000000000002,8.5,2.5,1.61,{"$f":"IF(OR(F13=\"\",H13=\"\"),\"\",IF((F13*H13-1)>=settings!$B$9,settings!$B$2/settings!$B$5*(F13*H13-1)/(mlb!H13-1),0))","v":96.666666666666686},{"$f":"IF(OR(F13=\"\",I13=\"\"),\"\",IF(((1-F13)*I13-1)>=settings!$B$10,settings!$B$2/settings!$B$5*((1-F13)*I13-1)/(I13-1),0))","v":0},{"$f":"IF(OR(G13=\"\",M13=\"\"),\"\",EXP(VLOOKUP(M13,settings!$F$3:$H$23,2)+VLOOKUP(M13,settings!$F$3:$H$23,3)*G13)/(1+EXP(VLOOKUP(M13,settings!$F$3:$H$23,2)+VLOOKUP(M13,settings!$F$3:$H$23,3)*G13)))","v":0.47962483165548392},8,1.95,1.95,{"$f":"IF(OR(M13=\"\",L13=\"\",N13=\"\",G13=\"\"),\"\",IF((L13*N13-1)>=settings!$B$12,settings!$B$2/settings!$B$6*(L13*N13-1)/(N13-1),0))","v":0},{"$f":"IF(OR(M13=\"\",L13=\"\",O13=\"\",G13=\"\"),\"\",IF(((1-L13)*O13-1)>=settings!$B$13,settings!$B$2/settings!$B$6*((1-L13)*O13-1)/(O13-1),0))","v":0}]
["2014-05-25","Minnesota","San Francisco","Ricky Nolasco","Madison Bumgarner",0.437,7.6,2.46,1.63,{"$f":"IF(OR(F14=\"\",H14=\"\"),\"\",IF((F14*H14-1)>=settings!$B$9,settings!$B$2/settings!$B$5*(F14*H14-1)/(mlb!H14-1),0))","v":51.383561643835677},{"$f":"IF(OR(F14=\"\",I14=\"\"),\"\",IF(((1-F14)*I14-1)>=settings!$B$10,settings!$B$2/settings!$B$5*((1-F14)*I14-1)/(I14-1),0))","v":0},{"$f":"IF(OR(G14=\"\",M14=\"\"),\"\",EXP(VLOOKUP(M14,settings!$F$3:$H$23,2)+VLOOKUP(M14,settings!$F$3:$H$23,3)*G14)/(1+EXP(VLOOKUP(M14,settings!$F$3:$H$23,2)+VLOOKUP(M14,settings!$F$3:$H$23,3)*G14)))","v":0.45565957466969481},7.5,2.09,1.83,{"$f":"IF(OR(M14=\"\",L14=\"\",N14=\"\",G14=\"\"),\"\",IF((L14*N14-1)>=settings!$B$12,settings!$B$2/settings!$B$6*(L14*N14-1)/(N14-1),0))","v":0},{"$f":"IF(OR(M14=\"\",L14=\"\",O14=\"\",G14=\"\"),\"\",IF(((1-L14)*O14-1)>=settings!$B$13,settings!$B$2/settings!$B$6*((1-L14)*O14-1)/(O14-1),0))","v":0}]
["2014-05-25","Chicago Cubs","San Diego","Jason Hammel","Ian Kennedy",0.48199999999999998,6.9,2.2599999999999998,1.73,{"$f":"IF(OR(F15=\"\",H15=\"\"),\"\",IF((F15*H15-1)>=settings!$B$9,settings!$B$2/settings!$B$5*(F15*H15-1)/(mlb!H15-1),0))","v":70.888888888888786},{"$f":"IF(OR(F15=\"\",I15=\"\"),\"\",IF(((1-F15)*I15-1)>=settings!$B$10,settings!$B$2/settings!$B$5*((1-F15)*I15-1)/(I15-1),0))","v":0},{"$f":"IF(OR(G15=\"\",M15=\"\"),\"\",EXP(VLOOKUP(M15,settings!$F$3:$H$23,2)+VLOOKUP(M15,settings!$F$3:$H$23,3)*G15)/(1+EXP(VLOOKUP(M15,settings!$F$3:$H$23,2)+VLOOKUP(M15,settings!$F$3:$H$23,3)*G15)))","v":0.52437877944818145},6.5,2.02,1.88,{"$f":"IF(OR(M15=\"\",L15=\"\",N15=\"\",G15=\"\"),\"\",IF((L15*N15-1)>=settings!$B$12,settings!$B$2/settings!$B$6*(L15*N15-1)/(N15-1),0))","v":58.083465181692787},{"$f":"IF(OR(M15=\"\",L15=\"\",O15=\"\",G15=\"\"),\"\",IF(((1-L15)*O15-1)>=settings!$B$13,settings!$B$2/settings!$B$6*((1-L15)*O15-1)/(O15-1),0))","v":0}]
["2014-05-25","Houston","Seattle","Dallas Keuchel","Hisashi Iwakuma",0.439,7.7,2.5,1.61,{"$f":"IF(OR(F16=\"\",H16=\"\"),\"\",IF((F16*H16-1)>=settings!$B$9,settings!$B$2/settings!$B$5*(F16*H16-1)/(mlb!H16-1),0))","v":64.999999999999943},{"$f":"IF(OR(F16=\"\",I16=\"\"),\"\",IF(((1-F16)*I16-1)>=settings!$B$10,settings!$B$2/settings!$B$5*((1-F16)*I16-1)/(I16-1),0))","v":0},{"$f":"IF(OR(G16=\"\",M16=\"\"),\"\",EXP(VLOOKUP(M16,settings!$F$3:$H$23,2)+VLOOKUP(M16,settings!$F$3:$H$23,3)*G16)/(1+EXP(VLOOKUP(M16,settings!$F$3:$H$23,2)+VLOOKUP(M16,settings!$F$3:$H$23,3)*G16)))","v":0.58594449604358068},6.5,1.93,1.98,{"$f":"IF(OR(M16=\"\",L16=\"\",N16=\"\",G16=\"\"),\"\",IF((L16*N16-1)>=settings!$B$12,settings!$B$2/settings!$B$6*(L16*N16-1)/(N16-1),0))","v":140.72352404743071},{"$f":"IF(OR(M16=\"\",L16=\"\",O16=\"\",G16=\"\"),\"\",IF(((1-L16)*O16-1)>=settings!$B$13,settings!$B$2/settings!$B$6*((1-L16)*O16-1)/(O16-1),0))","v":0}]
["2014-05-25","Arizona","NY Mets","Zeke Spruill","Daisuke Matsuzaka",0.46400000000000002,8,1.94,1.98,{"$f":"IF(OR(F17=\"\",H17=\"\"),\"\",IF((F17*H17-1)>=settings!$B$9,settings!$B$2/settings!$B$5*(F17*H17-1)/(mlb!H17-1),0))","v":0},{"$f":"IF(OR(F17=\"\",I17=\"\"),\"\",IF(((1-F17)*I17-1)>=settings!$B$10,settings!$B$2/settings!$B$5*((1-F17)*I17-1)/(I17-1),0))","v":62.530612244897959},{"$f":"IF(OR(G17=\"\",M17=\"\"),\"\",EXP(VLOOKUP(M17,settings!$F$3:$H$23,2)+VLOOKUP(M17,settings!$F$3:$H$23,3)*G17)/(1+EXP(VLOOKUP(M17,settings!$F$3:$H$23,2)+VLOOKUP(M17,settings!$F$3:$H$23,3)*G17)))","v":0.55422208300976628},7,1.89,1.97,{"$f":"IF(OR(M17=\"\",L17=\"\",N17=\"\",G17=\"\"),\"\",IF((L17*N17-1)>=settings!$B$12,settings!$B$2/settings!$B$6*(L17*N17-1)/(N17-1),0))","v":0},{"$f":"IF(OR(M17=\"\",L17=\"\",O17=\"\",G17=\"\"),\"\",IF(((1-L17)*O17-1)>=settings!$B$13,settings!$B$2/settings!$B$6*((1-L17)*O17-1)/(O17-1),0))","v":0}]
["2014-05-25","Colorado","Atlanta","Franklin Morales","Julio Teheran",0.496,7.2,2.5,1.61,{"$f":"IF(OR(F18=\"\",H18=\"\"),\"\",IF((F18*H18-1)>=settings!$B$9,settings!$B$2/settings!$B$5*(F18*H18-1)/(mlb!H18-1),0))","v":160},{"$f":"IF(OR(F18=\"\",I18=\"\"),\"\",IF(((1-F18)*I18-1)>=settings!$B$10,settings!$B$2/settings!$B$5*((1-F18)*I18-1)/(I18-1),0))","v":0},{"$f":"IF(OR(G18=\"\",M18=\"\"),\"\",EXP(VLOOKUP(M18,settings!$F$3:$H$23,2)+VLOOKUP(M18,settings!$F$3:$H$23,3)*G18)/(1+EXP(VLOOKUP(M18,settings!$F$3:$H$23,2)+VLOOKUP(M18,settings!$F$3:$H$23,3)*G18)))","v":0.42603733159906421},7.5,1.99,1.92,{"$f":"IF(OR(M18=\"\",L18=\"\",N18=\"\",G18=\"\"),\"\",IF((L18*N18-1)>=settings!$B$12,settings!$B$2/settings!$B$6*(L18*N18-1)/(N18-1),0))","v":0},{"$f":"IF(OR(M18=\"\",L18=\"\",O18=\"\",G18=\"\"),\"\",IF(((1-L18)*O18-1)>=settings!$B$13,settings!$B$2/settings!$B$6*((1-L18)*O18-1)/(O18-1),0))","v":110.8786123149963}]
["2014-05-25","St Louis","Cincinnati","Adam Wainwright","Mike Leake",0.501,7.3,1.67,2.38,{"$f":"IF(OR(F19=\"\",H19=\"\"),\"\",IF((F19*H19-1)>=settings!$B$9,settings!$B$2/settings!$B$5*(F19*H19-1)/(mlb!H19-1),0))","v":0},{"$f":"IF(OR(F19=\"\",I19=\"\"),\"\",IF(((1-F19)*I19-1)>=settings!$B$10,settings!$B$2/settings!$B$5*((1-F19)*I19-1)/(I19-1),0))","v":135.95652173913035},{"$f":"IF(OR(G19=\"\",M19=\"\"),\"\",EXP(VLOOKUP(M19,settings!$F$3:$H$23,2)+VLOOKUP(M19,settings!$F$3:$H$23,3)*G19)/(1+EXP(VLOOKUP(M19,settings!$F$3:$H$23,2)+VLOOKUP(M19,settings!$F$3:$H$23,3)*G19)))","v":0.55537412048628854},6.5,1.79,2.15,{"$f":"IF(OR(M19=\"\",L19=\"\",N19=\"\",G19=\"\"),\"\",IF((L19*N19-1)>=settings!$B$12,settings!$B$2/settings!$B$6*(L19*N19-1)/(N19-1),0))","v":0},{"$f":"IF(OR(M19=\"\",L19=\"\",O19=\"\",G19=\"\"),\"\",IF(((1-L19)*O19-1)>=settings!$B$13,settings!$B$2/settings!$B$6*((1-L19)*O19-1)/(O19-1),0))","v":0}]
[null,null,null,null,null,null,null,null,null,{"$f":"IF(OR(F20=\"\",H20=\"\"),\"\",IF((F20*H20-1)>=settings!$B$9,settings!$B$2/settings!$B$5*(F20*H20-1)/(mlb!H20-1),0))","v":""},{"$f":"IF(OR(F20=\"\",I20=\"\"),\"\",IF(((1-F20)*I20-1)>=settings!$B$10,settings!$B$2/settings!$B$5*((1-F20)*I20-1)/(I20-1),0))","v":""},{"$f":"IF(OR(G20=\"\",M20=\"\"),\"\",EXP(VLOOKUP(M20,settings!$F$3:$H$23,2)+VLOOKUP(M20,settings!$F$3:$H$23,3)*G20)/(1+EXP(VLOOKUP(M20,settings!$F$3:$H$23,2)+VLOOKUP(M20,settings!$F$3:$H$23,3)*G20)))","v":""},null,null,null,{"$f":"IF(OR(M20=\"\",L20=\"\",N20=\"\",G20=\"\"),\"\",IF((L20*N20-1)>=settings!$B$12,settings!$B$2/settings!$B$6*(L20*N20-1)/(N20-1),0))","v":""},{"$f":"IF(OR(M20=\"\",L20=\"\",O20=\"\",G20=\"\"),\"\",IF(((1-L20)*O20-1)>=settings!$B$13,settings!$B$2/settings!$B$6*((1-L20)*O20-1)/(O20-1),0))","v":""}]
{"$rows_left_out":20}